Skip to content
Navigation Menu
Sign in
Appearance settings
Platform
AI CODE CREATION
GitHub Copilot
Write better code with AI
GitHub Copilot app
Direct agents from issue to merge
MCP Registry
Integrate external tools
DEVELOPER WORKFLOWS
Actions
Automate any workflow
Codespaces
Instant dev environments
Issues
Plan and track work
Code Review
Manage code changes
Code Quality
Enforce quality at merge
APPLICATION SECURITY
GitHub Advanced Security
Find and fix vulnerabilities
Code security
Secure your code as you build
Secret protection
Stop leaks before they start
EXPLORE
Why GitHub
Documentation
Blog
Changelog
Marketplace
View all features
Solutions
BY COMPANY SIZE
Enterprises
Small and medium teams
Startups
Nonprofits
BY USE CASE
App Modernization
DevSecOps
DevOps
CI/CD
View all use cases
BY INDUSTRY
Healthcare
Financial services
Manufacturing
Government
View all industries
View all solutions
Resources
EXPLORE BY TOPIC
AI
Software Development
DevOps
Security
View all topics
EXPLORE BY TYPE
Customer stories
Events & webinars
Ebooks & reports
Business insights
GitHub Skills
SUPPORT & SERVICES
Documentation
Customer support
Community forum
Trust center
Partners
View all resources
Open Source
COMMUNITY
GitHub Sponsors
Fund open source developers
PROGRAMS
Security Lab
Maintainer Community
GitHub Stars
Archive Program
REPOSITORIES
Topics
Trending
Collections
Enterprise
ENTERPRISE SOLUTIONS
Enterprise platform
AI-powered developer platform
AVAILABLE ADD-ONS
GitHub Advanced Security
Enterprise-grade security features
Copilot for Business
Enterprise-grade AI features
Premium Support
Enterprise-grade 24/7 support
Pricing
Search
/
Sign in
Sign up
Appearance settings
You signed in with another tab or window.
Reload
to refresh your session.
You signed out in another tab or window.
Reload
to refresh your session.
You switched accounts on another tab or window.
Reload
to refresh your session.
Dismiss alert
{{ message }}
eclipse-openj9
/
openj9
Public
Notifications
You must be signed in to change notification settings
Fork
795
Star
3.5k
Code
Issues
3k
Pull requests
284
Actions
Projects
Wiki
Security and quality
2
Insights
Additional navigation options
Code
Issues
Pull requests
Actions
Projects
Wiki
Security and quality
Insights
Actions: eclipse-openj9/openj9
Actions
All workflows
Workflows
Auto test PR
Auto test PR
Linter
Linter
PR Comment Build Action for openj9
PR Comment Build Action for openj9
Remove autoTestPR branch
Remove autoTestPR branch
Run when "triagerx" is mentioned in an issue comment
Run when "triagerx" is mentioned in an issue comment
Triager on Closed issues
Triager on Closed issues
Disabled
Triager on Opened issues
Triager on Opened issues
Disabled
Show more workflows...
Management
Caches
Auto test PR
Auto test PR
Actions
Loading...
Loading
Sorry, something went wrong.
Uh oh!
There was an error while loading.
Please reload this page
.
will be ignored since log searching is not yet available
Show workflow options
Create status badge
Create status badge
Loading
Uh oh!
There was an error while loading.
Please reload this page
.
autoTestPR.yml
will be ignored since log searching is not yet available
2,500+ workflow runs
2,500+ workflow runs
Event
Filter by Event
Sorry, something went wrong.
Filter
Loading
Sorry, something went wrong.
No matching events.
Status
Filter by Status
Sorry, something went wrong.
Filter
Loading
Sorry, something went wrong.
No matching statuses.
Branch
Filter by Branch
Sorry, something went wrong.
Filter
Loading
Sorry, something went wrong.
No matching branches.
Actor
Filter by Actor
Sorry, something went wrong.
Filter
Loading
Sorry, something went wrong.
No matching users.
Non-fatal assert triggered in jdk_lang_0: 64-bit displacement should have been replaced
Auto test PR
#69618:
Issue comment
#20066 (comment)
created by
hzongaro
1s
1s
View workflow file
Update code to match expected messages for tests in NPEInPreviewTest
Auto test PR
#69617:
Issue comment
#24789 (comment)
created by
hangshao0
1s
1s
View workflow file
FFM: exception raised in an upcall crashes the VM once the downcall is JIT-compiled (UpcallExceptionHandler.cpp:92 / segfault in longjmp)
Auto test PR
#69616:
Issue comment
#24646 (comment)
created by
dchopra001
1s
1s
View workflow file
JDK 25 / 0.61.0: SIGSEGV in MM_Scavenger scanning virtual-thread carrier stacks (standalone reproducer)
Auto test PR
#69615:
Issue comment
#24763 (comment)
created by
dmitripivkine
1s
1s
View workflow file
Fix JNI global reference leak in MethodHandle thunk compilation
Auto test PR
#69614:
Issue comment
#24792 (comment)
created by
mpirvu
2s
2s
View workflow file
Fix JNI global reference leak in MethodHandle thunk compilation
Auto test PR
#69613:
Issue comment
#24792 (comment)
created by
nbhuiyan
11s
11s
View workflow file
cmdLineTester_jfr_0 j9vm.227 ASSERTION FAILED vm/VMAccess.cpp:431: ((vmThread)->publicFlags & J9_PUBLIC_FLAGS_VM_ACCESS)
Auto test PR
#69612:
Issue comment
#24693 (comment)
created by
tomal-majumder
2s
2s
View workflow file
JDK 25 / 0.61.0: SIGSEGV in MM_Scavenger scanning virtual-thread carrier stacks (standalone reproducer)
Auto test PR
#69611:
Issue comment
#24763 (comment)
created by
KavinSatheeskumar
1s
1s
View workflow file
NestAttributeTest NullPointerException: Cannot invoke "java.util.Hashtable.put(java.lang.Object, java.lang.Object)" because "this.packageSigners" is null
Auto test PR
#69610:
Issue comment
#24631 (comment)
created by
pshipton
4s
4s
View workflow file
NestAttributeTest NullPointerException: Cannot invoke "java.util.Hashtable.put(java.lang.Object, java.lang.Object)" because "this.packageSigners" is null
Auto test PR
#69609:
Issue comment
#24631 (comment)
created by
pshipton
2m 20s
2m 20s
View workflow file
jdk_doublevector128_j9_0 jdk/incubator/vector/DoubleVector128Tests.java Assertion failed at omr/compiler/z/codegen/OMRTreeEvaluator.cpp:16636: cg->comp()->target().cpu.supportsFeature(135) Unhandled trap vmState=0x0005ff04
Auto test PR
#69608:
Issue comment
#24691 (comment)
created by
hzongaro
6s
6s
View workflow file
Fix JNI global reference leak in MethodHandle thunk compilation
Auto test PR
#69607:
Issue comment
#24792 (comment)
created by
nbhuiyan
1s
1s
View workflow file
NestAttributeTest NullPointerException: Cannot invoke "java.util.Hashtable.put(java.lang.Object, java.lang.Object)" because "this.packageSigners" is null
Auto test PR
#69606:
Issue comment
#24631 (comment)
created by
jasonkatonica
6s
6s
View workflow file
Fix JNI global reference leak in MethodHandle thunk compilation
Auto test PR
#69605:
Issue comment
#24792 (comment)
created by
mpirvu
2s
2s
View workflow file
[17/21/25/26] Fatal assertion at gc/base/MemoryPoolLargeObjects.cpp:343 (loaFreeBytes > _loaSize) with -Xgc:concurrentScavenge and pinned nursery
Auto test PR
#69604:
Issue comment
#24797 (comment)
created by
dmitripivkine
1s
1s
View workflow file
MBCS_Tests_i18n_zh_TW_linux_0 FAILED ot ok 3 - DateFormatTest
Auto test PR
#69603:
Issue comment
#24546 (comment)
created by
andrew-m-leonard
1s
1s
View workflow file
JIT miscompiles nested floating-point ternary operators during constant folding (IL Simplifier bug), producing an exact offset error
Auto test PR
#69602:
Issue comment
#24798 (comment)
created by
pshipton
2s
2s
View workflow file
JIT miscompiles nested float ternary operators (CMoveF) when arguments are propagated via MethodHandle inlining
Auto test PR
#69601:
Issue comment
#24799 (comment)
created by
pshipton
2s
2s
View workflow file
JIT miscompiles GetStatic field load, incorrectly evaluating System.out as null after hot loop with MethodHandles
Auto test PR
#69600:
Issue comment
#24800 (comment)
created by
pshipton
1s
1s
View workflow file
[17/21/25/26] Fatal assertion at gc/base/MemoryPoolLargeObjects.cpp:343 (loaFreeBytes > _loaSize) with -Xgc:concurrentScavenge and pinned nursery
Auto test PR
#69599:
Issue comment
#24797 (comment)
created by
dmitripivkine
1s
1s
View workflow file
JFR Test Failure: TestLogOutput
Auto test PR
#69598:
Issue comment
#23724 (comment)
created by
JasonFengJ9
Skipped
Skipped
View workflow file
MBCS_Tests_i18n_zh_TW_linux_0 FAILED ot ok 3 - DateFormatTest
Auto test PR
#69597:
Issue comment
#24546 (comment)
created by
JasonFengJ9
1s
1s
View workflow file
X86: Check negative second dimension length for multianewarray
Auto test PR
#69596:
Issue comment
#24780 (comment)
created by
0xdaryl
1s
1s
View workflow file
MBCS_Tests_i18n_zh_TW_linux_0 FAILED ot ok 3 - DateFormatTest
Auto test PR
#69595:
Issue comment
#24546 (comment)
created by
adamfarley
1s
1s
View workflow file
FFM: exception raised in an upcall crashes the VM once the downcall is JIT-compiled (UpcallExceptionHandler.cpp:92 / segfault in longjmp)
Auto test PR
#69594:
Issue comment
#24646 (comment)
created by
gacholio
9s
9s
View workflow file
Previous
1
2
3
4
5
…
99
100
101
Next
You can’t perform that action at this time.